Target
Prostaglandin G/H synthase 2
Ligand
BDBM50110998
Substrate
Meas. Tech.
ChEMBL_159757 (CHEMBL763083)
IC50
26±n/a nM
Citation
 Hashimoto, HImamura, KHaruta, JWakitani, K 4-(4-cycloalkyl/aryl-oxazol-5-yl)benzenesulfonamides as selective cyclooxygenase-2 inhibitors: enhancement of the selectivity by introduction of a fluorine atom and identification of a potent, highly selective, and orally active COX-2 inhibitor JTE-522(1). J Med Chem 45:1511-7 (2002)  
Target
Name:
Prostaglandin G/H synthase 2
Synonyms:
COX2 Cyclooxygenase 2 (COX-2) Cyclooxygenase-2 (COX-2 AA) Cyclooxygenase-2 (COX-2) PGH2_HUMAN PHS II Prostaglandin E synthase/G/H synthase 2 Prostaglandin-endoperoxide synthase 2
Type:
Enzyme
Mol. Mass.:
69003.89
Organism:
Homo sapiens (Human)
Description:
Recombinant Cox-2 provided by Cayman (Cayman Chemical Co.,Ann Arbor, MI).
Residue:
604
  
Inhibitor
Name:
BDBM50110998
Synonyms:
2-Fluoro-4-[2-methyl-4-(5-methyl-thiophen-2-yl)-oxazol-5-yl]-benzenesulfonamide | CHEMBL284761
Type:
Small organic molecule
Emp. Form.:
C15H13FN2O3S2
Mol. Mass.:
352.404
SMILES:
Cc1ccc(s1)-c1nc(C)oc1-c1ccc(c(F)c1)S(N)(=O)=O
: