Target
Beta-galactosidase
Ligand
BDBM50111589
Substrate
Meas. Tech.
ChEMBL_37409 (CHEMBL651841)
IC50
200000±n/a nM
Citation
 McGovern, SLCaselli, EGrigorieff, NShoichet, BK A common mechanism underlying promiscuous inhibitors from virtual and high-throughput screening. J Med Chem 45:1712-22 (2002)  
Target
Name:
Beta-galactosidase
Synonyms:
Acid beta-galactosidase ELNR1 GLB1 | Lactase
Type:
PROTEIN
Mol. Mass.:
76074.43
Organism:
Homo sapiens (Human)
Description:
ChEMBL_215886
Residue:
677
  
Inhibitor
Name:
BDBM50111589
Synonyms:
2-[(3,5-diiodo-4-oxidophenyl)(3,5-diiodo-4-oxocyclohexa-2,5-dien-1-ylidene)methyl]benzoate | 2-[3,5-diiodo-4-olatophenyl(3,5-diiodo-4-oxo-2,5-cyclohexadienyliden)methyl]benzoate
Type:
Small organic molecule
Emp. Form.:
C20H8I4O4
Mol. Mass.:
819.8941
SMILES:
[#8-]-[#6](=O)-c1ccccc1\[#6](=[#6]-1\[#6]=[#6](I)-[#6](=O)-[#6](I)=[#6]-1)-c1cc(I)c(-[#8-])c(I)c1
: