Target
Beta-galactosidase
Ligand
BDBM50105977
Substrate
Meas. Tech.
ChEMBL_37409 (CHEMBL651841)
IC50
600000±n/a nM
Citation
 McGovern, SLCaselli, EGrigorieff, NShoichet, BK A common mechanism underlying promiscuous inhibitors from virtual and high-throughput screening. J Med Chem 45:1712-22 (2002)  
Target
Name:
Beta-galactosidase
Synonyms:
Acid beta-galactosidase ELNR1 GLB1 | Lactase
Type:
PROTEIN
Mol. Mass.:
76074.43
Organism:
Homo sapiens (Human)
Description:
ChEMBL_215886
Residue:
677
  
Inhibitor
Name:
BDBM50105977
Synonyms:
3-Hydroxy-4-(2-hydroxy-naphthalen-1-ylazo)-naphthalene-1-sulfonic acid CHEMBL124855
Type:
Small organic molecule
Emp. Form.:
C20H14N2O5S
Mol. Mass.:
394.401
SMILES:
Oc1ccc2ccccc2c1N=Nc1c(O)cc(c2ccccc12)S(O)(=O)=O
: