Target
Beta-lactamase
Ligand
BDBM60927
Substrate
Meas. Tech.
ChEMBL_216015 (CHEMBL820516)
IC50
>1600000±n/a nM
Citation
 McGovern, SLCaselli, EGrigorieff, NShoichet, BK A common mechanism underlying promiscuous inhibitors from virtual and high-throughput screening. J Med Chem 45:1712-22 (2002)  
Target
Name:
Beta-lactamase
Synonyms:
AMPC_ECOLI Beta-lactamase (AmpC) Cephalosporinase ampA | ampC
Type:
Protien
Mol. Mass.:
41561.62
Organism:
Escherichia coli
Description:
P00811
Residue:
377
  
Inhibitor
Name:
BDBM60927
Synonyms:
1-anilinonaphthalene-8-sulfonic acid ANS BDBM50126831
Type:
Emp. Form.:
C16H13NO3S
Mol. Mass.:
299.344
SMILES:
OS(=O)(=O)c1cccc2cccc(Nc3ccccc3)c12
: