Target
Cholinesterase
Ligand
BDBM8970
Substrate
Meas. Tech.
ChEMBL_41269 (CHEMBL655026)
Ki
35±n/a nM
Citation
 Savini, LGaeta, AFattorusso, CCatalanotti, BCampiani, GChiasserini, LPellerano, CNovellino, EMcKissic, DSaxena, A Specific targeting of acetylcholinesterase and butyrylcholinesterase recognition sites. Rational design of novel, selective, and highly potent cholinesterase inhibitors. J Med Chem 46:1-4 (2002)  
Target
Name:
Cholinesterase
Synonyms:
Acylcholine acylhydrolase Butyrylcholine esterase (BChE) Butyrylcholinesterase (BuChE) CHLE_HUMAN Cholinesterases Pseudocholinesterase
Type:
Homotetramer
Mol. Mass.:
68422.27
Organism:
Homo sapiens (Human)
Description:
P06276
Residue:
602
  
Inhibitor
Name:
BDBM8970
Synonyms:
CHEMBL51197 Tacrine Dimer 4f | tacrine heterobivalent compound 3e
Type:
Small organic molecule
Emp. Form.:
C33H39N3S
Mol. Mass.:
509.748
SMILES:
C(CCCNc1c2CCCCc2nc2ccccc12)CCCSc1c2CCCCc2nc2ccccc12
: