Target
D(1A) dopamine receptor
Ligand
BDBM50058225
Substrate
Meas. Tech.
ChEMBL_60345 (CHEMBL671331)
Ki
>10000±n/a nM
Citation
 Macchia, MCervetto, LDemontis, GCLongoni, BMinutolo, FOrlandini, EOrtore, GPapi, CSbrana, AMacchia, B New N-n-propyl-substituted 3-aryl- and 3-cyclohexylpiperidines as partial agonists at the D4 dopamine receptor. J Med Chem 46:161-8 (2002)  
Target
Name:
D(1A) dopamine receptor
Synonyms:
D(1A) dopamine receptor DOPAMINE D1 DRD1_BOVIN | Dopamine receptor
Type:
Enzyme Catalytic Domain
Mol. Mass.:
49330.65
Organism:
BOVINE
Description:
DOPAMINE D1 DRD1 BOVINE::Q95136
Residue:
446
  
Inhibitor
Name:
BDBM50058225
Synonyms:
CHEMBL45244 N-[4-(2-Cyano-phenyl)-piperazin-1-ylmethyl]-3-methyl-benzamide | PD-168077
Type:
Small organic molecule
Emp. Form.:
C20H22N4O
Mol. Mass.:
334.4149
SMILES:
Cc1cccc(c1)C(=O)NCN1CCN(CC1)c1ccccc1C#N
: