Target
Receptor tyrosine-protein kinase erbB-2
Ligand
BDBM50122589
Substrate
Meas. Tech.
ChEMBL_161599 (CHEMBL769139)
IC50
7800±n/a nM
Citation
 Wissner, AOverbeek, EReich, MFFloyd, MBJohnson, BDMamuya, NRosfjord, ECDiscafani, CDavis, RShi, XRabindran, SKGruber, BCYe, FHallett, WANilakantan, RShen, RWang, YFGreenberger, LMTsou, HR Synthesis and structure-activity relationships of 6,7-disubstituted 4-anilinoquinoline-3-carbonitriles. The design of an orally active, irreversible inhibitor of the tyrosine kinase activity of the epidermal growth factor receptor (EGFR) and the human epidermal growth factor receptor-2 (HER-2). J Med Chem 46:49-63 (2002)  
Target
Name:
Receptor tyrosine-protein kinase erbB-2
Synonyms:
2.7.10.1 CD_antigen=CD340 ERBB2_HUMAN FASN/HER2 HER2 MLN19 NEU Proto-oncogene Neu Tyrosine kinase-type cell surface receptor HER2 | p185erbB2
Type:
Mol. Mass.:
137894.47
Organism:
Homo sapiens (Human)
Description:
P04626
Residue:
1255
  
Inhibitor
Name:
BDBM50122589
Synonyms:
(E)-4-Diethylamino-but-2-enoic acid [4-(3-chloro-4-fluoro-phenylamino)-3-cyano-7-methoxy-quinolin-6-yl]-amide CHEMBL424252
Type:
Small organic molecule
Emp. Form.:
C25H25ClFN5O2
Mol. Mass.:
481.95
SMILES:
CCN(CC)C\C=C\C(=O)Nc1cc2c(Nc3ccc(F)c(Cl)c3)c(cnc2cc1OC)C#N
: