Target
Cytochrome P450 2D4
Ligand
BDBM112777
Substrate
Meas. Tech.
ChEMBL_51712 (CHEMBL665727)
IC50
19300±n/a nM
Citation
 Venhorst, Jter Laak, AMCommandeur, JNFunae, YHiroi, TVermeulen, NP Homology modeling of rat and human cytochrome P450 2D (CYP2D) isoforms and computational rationalization of experimental ligand-binding specificities. J Med Chem 46:74-86 (2002)  
Target
Name:
Cytochrome P450 2D4
Synonyms:
CP2D4_RAT Cyp2d-18 Cyp2d18 Cytochrome P450 2D18 Cytochrome P450-CMF3 Debrisoquine 4-hydroxylase
Type:
PROTEIN
Mol. Mass.:
56689.73
Organism:
Rattus norvegicus
Description:
ChEMBL_1280215
Residue:
500
  
Inhibitor
Name:
BDBM112777
Synonyms:
NORTRIPTYLINE | US8629135, SW-02
Type:
Small organic molecule
Emp. Form.:
C19H21N
Mol. Mass.:
263.3767
SMILES:
[#6]-[#7]-[#6]-[#6]\[#6]=[#6]-1/c2ccccc2-[#6]-[#6]-c2ccccc-12
: