Target
Cytochrome P450 2D4
Ligand
BDBM50246936
Substrate
Meas. Tech.
ChEMBL_51712 (CHEMBL665727)
IC50
133000±n/a nM
Citation
 Venhorst, Jter Laak, AMCommandeur, JNFunae, YHiroi, TVermeulen, NP Homology modeling of rat and human cytochrome P450 2D (CYP2D) isoforms and computational rationalization of experimental ligand-binding specificities. J Med Chem 46:74-86 (2002)  
Target
Name:
Cytochrome P450 2D4
Synonyms:
CP2D4_RAT Cyp2d-18 Cyp2d18 Cytochrome P450 2D18 Cytochrome P450-CMF3 Debrisoquine 4-hydroxylase
Type:
PROTEIN
Mol. Mass.:
56689.73
Organism:
Rattus norvegicus
Description:
ChEMBL_1280215
Residue:
500
  
Inhibitor
Name:
BDBM50246936
Synonyms:
(-)-(S)-Propranolol CHEMBL452861 S-(-)-propanolol | [2-Hydroxy-3-(naphthalen-1-yloxy)-propyl]-isopropyl-ammonium((-)-propranolol)
Type:
Small organic molecule
Emp. Form.:
C16H21NO2
Mol. Mass.:
259.3434
SMILES:
CC(C)NC[C@H](O)COc1cccc2ccccc12
: