Target
Cytochrome P450 2D4
Ligand
BDBM50121975
Substrate
Meas. Tech.
ChEMBL_51712 (CHEMBL665727)
IC50
47200±n/a nM
Citation
 Venhorst, Jter Laak, AMCommandeur, JNFunae, YHiroi, TVermeulen, NP Homology modeling of rat and human cytochrome P450 2D (CYP2D) isoforms and computational rationalization of experimental ligand-binding specificities. J Med Chem 46:74-86 (2002)  
Target
Name:
Cytochrome P450 2D4
Synonyms:
CP2D4_RAT Cyp2d-18 Cyp2d18 Cytochrome P450 2D18 Cytochrome P450-CMF3 Debrisoquine 4-hydroxylase
Type:
PROTEIN
Mol. Mass.:
56689.73
Organism:
Rattus norvegicus
Description:
ChEMBL_1280215
Residue:
500
  
Inhibitor
Name:
BDBM50121975
Synonyms:
(6-Methoxy-quinolin-4-yl)-(5-vinyl-1-aza-bicyclo[2.2.2]oct-2-yl)-methanol CHEMBL1294 DURAQUIN QUINAGLUTE QUINATIME QUINIDINE US9402878, Quinidine
Type:
Small organic molecule
Emp. Form.:
C20H24N2O2
Mol. Mass.:
324.4168
SMILES:
COc1ccc2nccc([C@H](O)[C@H]3C[C@@H]4CCN3C[C@@H]4C=C)c2c1
: