Target
5-hydroxytryptamine receptor 6
Ligand
BDBM50085972
Substrate
Meas. Tech.
ChEMBL_3664 (CHEMBL620800)
Ki
60±n/a nM
Citation
 Glennon, RA Higher-end serotonin receptors: 5-HT(5), 5-HT(6), and 5-HT(7). J Med Chem 46:2795-812 (2003)  
Target
Name:
5-hydroxytryptamine receptor 6
Synonyms:
5-HT-6 5-hydroxytryptamine receptor 6 (5-HT-6) 5-hydroxytryptamine receptor 6 (5HT6) HTR6 Serotonin 6 (5-HT6) receptor | Serotonin Receptor 6
Type:
G Protein-Coupled Receptor (GPCR)
Mol. Mass.:
46968.43
Organism:
Homo sapiens (Human)
Description:
P50406
Residue:
440
  
Inhibitor
Name:
BDBM50085972
Synonyms:
CHEMBL7143 [2-(5-Methoxy-2-methyl-1H-indol-3-yl)-ethyl]-dimethyl-amine (C2H2O) | [2-(5-Methoxy-2-methyl-1H-indol-3-yl)-ethyl]-dimethyl-ammonium
Type:
Small organic molecule
Emp. Form.:
C14H20N2O
Mol. Mass.:
232.3214
SMILES:
COc1ccc2[nH]c(C)c(CCN(C)C)c2c1
: