Target
5-hydroxytryptamine receptor 6
Ligand
BDBM50106249
Substrate
Meas. Tech.
ChEMBL_3664 (CHEMBL620800)
Ki
1.5±n/a nM
Citation
 Glennon, RA Higher-end serotonin receptors: 5-HT(5), 5-HT(6), and 5-HT(7). J Med Chem 46:2795-812 (2003)  
Target
Name:
5-hydroxytryptamine receptor 6
Synonyms:
5-HT-6 5-hydroxytryptamine receptor 6 (5-HT-6) 5-hydroxytryptamine receptor 6 (5HT6) HTR6 Serotonin 6 (5-HT6) receptor | Serotonin Receptor 6
Type:
G Protein-Coupled Receptor (GPCR)
Mol. Mass.:
46968.43
Organism:
Homo sapiens (Human)
Description:
P50406
Residue:
440
  
Inhibitor
Name:
BDBM50106249
Synonyms:
CHEMBL92139 | [2-(1-Benzenesulfonyl-1H-indol-4-yl)-ethyl]-dimethyl-amine
Type:
Small organic molecule
Emp. Form.:
C18H20N2O2S
Mol. Mass.:
328.429
SMILES:
CN(C)CCc1cccc2n(ccc12)S(=O)(=O)c1ccccc1
: