Target
5-hydroxytryptamine receptor 6
Ligand
BDBM50130285
Substrate
Meas. Tech.
ChEMBL_3664 (CHEMBL620800)
Ki
0.300000±n/a nM
Citation
 Glennon, RA Higher-end serotonin receptors: 5-HT(5), 5-HT(6), and 5-HT(7). J Med Chem 46:2795-812 (2003)  
Target
Name:
5-hydroxytryptamine receptor 6
Synonyms:
5-HT-6 5-hydroxytryptamine receptor 6 (5-HT-6) 5-hydroxytryptamine receptor 6 (5HT6) HTR6 Serotonin 6 (5-HT6) receptor | Serotonin Receptor 6
Type:
G Protein-Coupled Receptor (GPCR)
Mol. Mass.:
46968.43
Organism:
Homo sapiens (Human)
Description:
P50406
Residue:
440
  
Inhibitor
Name:
BDBM50130285
Synonyms:
6-Bromo-1-(4-methoxy-3-piperazin-1-yl-benzenesulfonyl)-1H-indole | CHEMBL96745
Type:
Small organic molecule
Emp. Form.:
C19H20BrN3O3S
Mol. Mass.:
450.349
SMILES:
COc1ccc(cc1N1CCNCC1)S(=O)(=O)n1ccc2ccc(Br)cc12
: