Target
5-hydroxytryptamine receptor 6
Ligand
BDBM50090529
Substrate
Meas. Tech.
ChEMBL_3664 (CHEMBL620800)
Ki
0.700000±n/a nM
Citation
 Glennon, RA Higher-end serotonin receptors: 5-HT(5), 5-HT(6), and 5-HT(7). J Med Chem 46:2795-812 (2003)  
Target
Name:
5-hydroxytryptamine receptor 6
Synonyms:
5-HT-6 5-hydroxytryptamine receptor 6 (5-HT-6) 5-hydroxytryptamine receptor 6 (5HT6) HTR6 Serotonin 6 (5-HT6) receptor | Serotonin Receptor 6
Type:
G Protein-Coupled Receptor (GPCR)
Mol. Mass.:
46968.43
Organism:
Homo sapiens (Human)
Description:
P50406
Residue:
440
  
Inhibitor
Name:
BDBM50090529
Synonyms:
2-[1-(Naphthalene-1-sulfonyl)-1H-indol-6-yl]-octahydro-pyrrolo[1,2-a]pyrazine | CHEMBL46187
Type:
Small organic molecule
Emp. Form.:
C25H25N3O2S
Mol. Mass.:
431.55
SMILES:
O=S(=O)(c1cccc2ccccc12)n1ccc2ccc(cc12)N1CCN2CCCC2C1
: