Target
Neprilysin
Ligand
BDBM50130713
Substrate
Meas. Tech.
ChEMBL_144317 (CHEMBL754362)
IC50
20000±n/a nM
Citation
 Filimonov, DAGomazkov, OALagunin, AAGureeva, TADilakyan, EAKugaevskaya, EVElisseeva, YESolovyeva, NIPoroikov, VV Computer-aided selection of potential antihypertensive compounds with dual mechanism of action. J Med Chem 46:3326-32 (2003)  
Target
Name:
Neprilysin
Synonyms:
Atriopeptidase CD_antigen=CD10 EPN MME NEP_HUMAN Neutral endopeptidase | Neutral endopeptidase 24.11
Type:
Enzyme
Mol. Mass.:
85505.38
Organism:
Homo sapiens (Human)
Description:
P08473
Residue:
750
  
Inhibitor
Name:
BDBM50130713
Synonyms:
CHEMBL326801 | Thioacetic acid S-(2-benzylcarbamoyl-propyl) ester
Type:
Small organic molecule
Emp. Form.:
C13H17NO2S
Mol. Mass.:
251.345
SMILES:
CC(CSC(C)=O)C(=O)NCc1ccccc1
: