Target
NH(3)-dependent NAD(+) synthetase
Ligand
BDBM92599
Substrate
Meas. Tech.
ChEMBL_141613 (CHEMBL747929)
IC50
9000±n/a nM
Citation
 Velu, SECristofoli, WAGarcia, GJBrouillette, CGPierson, MCLuan, CHDeLucas, LJBrouillette, WJ Tethered dimers as NAD synthetase inhibitors with antibacterial activity. J Med Chem 46:3371-81 (2003)  
Target
Name:
NH(3)-dependent NAD(+) synthetase
Synonyms:
GSP38 NADE_BACSU Sporulation protein outB outB
Type:
PROTEIN
Mol. Mass.:
30386.77
Organism:
Bacillus subtilis
Description:
ChEMBL_141613
Residue:
272
  
Inhibitor
Name:
BDBM92599
Synonyms:
CHEMBL263057 | NAD Synthetase Inhibitor, 4
Type:
Organic molecule
Emp. Form.:
C35H43N2O5
Mol. Mass.:
571.7258
SMILES:
COC(=O)c1cc2cc(OCc3ccccc3)ccc2n1CCCCCCCOC(=O)Cc1ccc(cc1)[N+](C)(C)C
: