Target
NH(3)-dependent NAD(+) synthetase
Ligand
BDBM50130809
Substrate
Meas. Tech.
ChEMBL_141613 (CHEMBL747929)
IC50
29000±n/a nM
Citation
 Velu, SECristofoli, WAGarcia, GJBrouillette, CGPierson, MCLuan, CHDeLucas, LJBrouillette, WJ Tethered dimers as NAD synthetase inhibitors with antibacterial activity. J Med Chem 46:3371-81 (2003)  
Target
Name:
NH(3)-dependent NAD(+) synthetase
Synonyms:
GSP38 NADE_BACSU Sporulation protein outB outB
Type:
PROTEIN
Mol. Mass.:
30386.77
Organism:
Bacillus subtilis
Description:
ChEMBL_141613
Residue:
272
  
Inhibitor
Name:
BDBM50130809
Synonyms:
3-[6-(5-Benzyloxy-indol-1-yl)-hexyloxycarbonyl]-1-methyl-pyridinium; iodide | CHEMBL324149
Type:
Small organic molecule
Emp. Form.:
C28H31N2O3
Mol. Mass.:
443.5568
SMILES:
C[n+]1cccc(c1)C(=O)OCCCCCCn1ccc2cc(OCc3ccccc3)ccc12
: