Target
NH(3)-dependent NAD(+) synthetase
Ligand
BDBM50130828
Substrate
Meas. Tech.
ChEMBL_141613 (CHEMBL747929)
IC50
>200000±n/a nM
Citation
 Velu, SECristofoli, WAGarcia, GJBrouillette, CGPierson, MCLuan, CHDeLucas, LJBrouillette, WJ Tethered dimers as NAD synthetase inhibitors with antibacterial activity. J Med Chem 46:3371-81 (2003)  
Target
Name:
NH(3)-dependent NAD(+) synthetase
Synonyms:
GSP38 NADE_BACSU Sporulation protein outB outB
Type:
PROTEIN
Mol. Mass.:
30386.77
Organism:
Bacillus subtilis
Description:
ChEMBL_141613
Residue:
272
  
Inhibitor
Name:
BDBM50130828
Synonyms:
3-(2-{2-[2-(5-Benzyloxy-indol-1-yl)-ethoxy]-ethoxy}-ethoxycarbonyl)-1-methyl-pyridinium; iodide | CHEMBL112620
Type:
Small organic molecule
Emp. Form.:
C28H31N2O5
Mol. Mass.:
475.5556
SMILES:
C[n+]1cccc(c1)C(=O)OCCOCCOCCn1ccc2cc(OCc3ccccc3)ccc12
: