Target
Neurotensin receptor type 1
Ligand
BDBM50130887
Substrate
Meas. Tech.
ChEMBL_144289 (CHEMBL754790)
IC50
11.5±n/a nM
Citation
 Achilefu, SSrinivasan, ASchmidt, MAJimenez, HNBugaj, JEErion, JL Novel bioactive and stable neurotensin peptide analogues capable of delivering radiopharmaceuticals and molecular beacons to tumors. J Med Chem 46:3403-11 (2003)  
Target
Name:
Neurotensin receptor type 1
Synonyms:
Dopamine receptor D2L/neurotensin receptor NTS1 NTRR Neurotensin receptor 1 | neurotensin receptor type 1
Type:
PROTEIN
Mol. Mass.:
46278.89
Organism:
Homo sapiens (Human)
Description:
ChEMBL_1453811
Residue:
418
  
Inhibitor
Name:
BDBM50130887
Synonyms:
CHEMBL405160 | DTPA-DLys-ACA-Arg-Gly(PipAm)-Arg-Pro-Tyr-tBuGly-Leu-OH
Type:
Small organic molecule
Emp. Form.:
C70H116N22O20
Mol. Mass.:
1585.8054
SMILES:
[#6]-[#6](-[#6])-[#6]-[#6@H](-[#7]-[#6](=O)-[#6@@H](-[#7]-[#6](=O)-[#6@H](-[#6]-c1ccc(-[#8])cc1)-[#7]-[#6](=O)-[#6@@H]-1-[#6]-[#6]-[#6]-[#7]-1-[#6](=O)-[#6@H](-[#6]-[#6]-[#6]-[#7]-[#6](-[#7])=[#7])-[#7]-[#6](=O)-[#6@@H](-[#7]-[#6](=O)-[#6@H](-[#6]-[#6]-[#6]\[#7]=[#6](\[#7])-[#7])-[#7]-[#6](=O)-[#6@@H]-1-[#6]-[#6]-[#7]-1-[#6](=O)-[#6@@H](-[#6]-[#6]-[#6]-[#6]-[#7])-[#7]-[#6](=O)-[#6]-[#7](-[#6]-[#6]-[#7](-[#6]-[#6]-[#7](-[#6]-[#6](-[#8])=O)-[#6]-[#6](-[#8])=O)-[#6]-[#6](-[#8])=O)-[#6]-[#6](-[#8])=O)-[#6]-1-[#6]-[#6]-[#7](-[#6]-[#6]-1)-[#6](-[#7])=[#7])C([#6])([#6])[#6])-[#6](-[#8])=O
: