Target
Neurotensin receptor type 1
Ligand
BDBM50130888
Substrate
Meas. Tech.
ChEMBL_144289 (CHEMBL754790)
IC50
1.2±n/a nM
Citation
 Achilefu, SSrinivasan, ASchmidt, MAJimenez, HNBugaj, JEErion, JL Novel bioactive and stable neurotensin peptide analogues capable of delivering radiopharmaceuticals and molecular beacons to tumors. J Med Chem 46:3403-11 (2003)  
Target
Name:
Neurotensin receptor type 1
Synonyms:
Dopamine receptor D2L/neurotensin receptor NTS1 NTRR Neurotensin receptor 1 | neurotensin receptor type 1
Type:
PROTEIN
Mol. Mass.:
46278.89
Organism:
Homo sapiens (Human)
Description:
ChEMBL_1453811
Residue:
418
  
Inhibitor
Name:
BDBM50130888
Synonyms:
CHEMBL408534 | alpha-FITC-DLys-Pro-Gly(PipAm)-Arg-Pro-Tyr--Ile-Leu-OH
Type:
Small organic molecule
Emp. Form.:
C74H102N16O15S
Mol. Mass.:
1487.765
SMILES:
CCC(C)C(NC(=O)C(Cc1ccc(O)cc1)NC(=O)C1CCCN1C(=O)C(CCCNC(N)=N)NC(=O)C(NC(=O)C1CCCN1C(=O)[C@H](CCCCN)NC(=O)C1OC2(C3C=CC(=O)CC3Oc3cc(O)ccc23)c2ccc(NC(N)=S)cc12)C1CCC(CC1)C(N)=N)C(=O)NC(CC(C)C)C(O)=O
: