Target
Neurotensin receptor type 1
Ligand
BDBM50130892
Substrate
Meas. Tech.
ChEMBL_144289 (CHEMBL754790)
IC50
21.7±n/a nM
Citation
 Achilefu, SSrinivasan, ASchmidt, MAJimenez, HNBugaj, JEErion, JL Novel bioactive and stable neurotensin peptide analogues capable of delivering radiopharmaceuticals and molecular beacons to tumors. J Med Chem 46:3403-11 (2003)  
Target
Name:
Neurotensin receptor type 1
Synonyms:
Dopamine receptor D2L/neurotensin receptor NTS1 NTRR Neurotensin receptor 1 | neurotensin receptor type 1
Type:
PROTEIN
Mol. Mass.:
46278.89
Organism:
Homo sapiens (Human)
Description:
ChEMBL_1453811
Residue:
418
  
Inhibitor
Name:
BDBM50130892
Synonyms:
CHEMBL405804 | DTPA-DLys-Pro-Gly(PipAm)-Arg-Pro-Tyr-tBuGly-tBuAla-OH
Type:
Small organic molecule
Emp. Form.:
C67H110N18O19
Mol. Mass.:
1471.6995
SMILES:
COC(=O)[C@H](CC(C)(C)C)NC(=O)[C@@H](NC(=O)[C@H](Cc1ccc(O)cc1)NC(=O)[C@@H]1CCCN1C(=O)[C@H](CCCNC(N)=N)NC(=O)[C@@H](NC(=O)[C@@H]1CCCN1C(=O)[C@H](CCCCN)NC(=O)CN(CCN(CCN(CC(O)=O)CC(O)=O)CC(O)=O)CC(O)=O)C1CCN(CC1)C(N)=N)C(C)(C)C
: