Target
Neurotensin receptor type 1
Ligand
BDBM50130895
Substrate
Meas. Tech.
ChEMBL_144289 (CHEMBL754790)
IC50
0.3±n/a nM
Citation
 Achilefu, SSrinivasan, ASchmidt, MAJimenez, HNBugaj, JEErion, JL Novel bioactive and stable neurotensin peptide analogues capable of delivering radiopharmaceuticals and molecular beacons to tumors. J Med Chem 46:3403-11 (2003)  
Target
Name:
Neurotensin receptor type 1
Synonyms:
Dopamine receptor D2L/neurotensin receptor NTS1 NTRR Neurotensin receptor 1 | neurotensin receptor type 1
Type:
PROTEIN
Mol. Mass.:
46278.89
Organism:
Homo sapiens (Human)
Description:
ChEMBL_1453811
Residue:
418
  
Inhibitor
Name:
BDBM50130895
Synonyms:
CHEMBL408127 | DTPA-Cha(tr-4-Mam)-Pro-Arg-Gly(PipAm)-Arg-Pro-Tyr-tBuGly-Leu-OH
Type:
Small organic molecule
Emp. Form.:
C69H112N18O19
Mol. Mass.:
1497.7368
SMILES:
CC(C)C[C@H](NC(=O)[C@@H](NC(=O)[C@H](Cc1ccc(O)cc1)NC(=O)[C@@H]1CCCN1C(=O)[C@H](CCCNC(N)=N)NC(=O)[C@@H](NC(=O)[C@@H]1CCCN1C(=O)[C@H](CC1CCC(CN)CC1)NC(=O)CN(CCN(CCN(CC(O)=O)CC(O)=O)CC(O)=O)CC(O)=O)C1CCN(CC1)C(N)=N)C(C)(C)C)C(O)=O
: