Target
Purine nucleoside phosphorylase
Ligand
BDBM50422435
Substrate
Meas. Tech.
ChEMBL_162195 (CHEMBL856601)
Ki
0.180000±n/a nM
Citation
 Evans, GBFurneaux, RHLewandowicz, ASchramm, VLTyler, PC Exploring structure-activity relationships of transition state analogues of human purine nucleoside phosphorylase. J Med Chem 46:3412-23 (2003)  
Target
Name:
Purine nucleoside phosphorylase
Synonyms:
Inosine phosphorylase NP PNPH_HUMAN | Purine nucleoside phosphorylase (PNPase)
Type:
Enzyme
Mol. Mass.:
32119.53
Organism:
Homo sapiens (Human)
Description:
Residue:
289
  
Inhibitor
Name:
BDBM50422435
Synonyms:
CHEMBL2311112
Type:
Small organic molecule
Emp. Form.:
C10H13N5O4
Mol. Mass.:
267.2413
SMILES:
OC[C@H]1N[C@H]([C@H](O)[C@@H]1O)c1[nH]nc2c1nc[nH]c2=O
: