Target
Major prion protein
Ligand
BDBM22985
Substrate
Meas. Tech.
ChEMBL_158887 (CHEMBL760875)
EC50
4000±n/a nM
Citation
 Vogtherr, MGrimme, SElshorst, BJacobs, DMFiebig, KGriesinger, CZahn, R Antimalarial drug quinacrine binds to C-terminal helix of cellular prion protein. J Med Chem 46:3563-4 (2003)  
Target
Name:
Major prion protein
Synonyms:
ALTPRP CD_antigen=CD230 PRIP PRP PrP33-35C major prion protein preproprotein
Type:
PROTEIN
Mol. Mass.:
27671.97
Organism:
Homo sapiens (Human)
Description:
ChEMBL_158887
Residue:
253
  
Inhibitor
Name:
BDBM22985
Synonyms:
Aralen CHLOROQUINE PHOSPHATE Chloroquine med.21724, Compound 8 | {4-[(7-chloroquinolin-4-yl)amino]pentyl}diethylamine
Type:
Antimalarial
Emp. Form.:
C18H26ClN3
Mol. Mass.:
319.872
SMILES:
CCN(CC)CCCC(C)Nc1ccnc2cc(Cl)ccc12
: