Target
Melanocortin receptor 3
Ligand
BDBM82411
Substrate
Meas. Tech.
ChEMBL_106011 (CHEMBL716367)
IC50
3.3±n/a nM
Citation
 Balse-Srinivasan, PGrieco, PCai, MTrivedi, DHruby, VJ Structure-activity relationships of novel cyclic alpha-MSH/beta-MSH hybrid analogues that lead to potent and selective ligands for the human MC3R and human MC5R. J Med Chem 46:3728-33 (2003)  
Target
Name:
Melanocortin receptor 3
Synonyms:
MC3-R MC3R_HUMAN Melanocortin receptor (M3 and M4)
Type:
Enzyme
Mol. Mass.:
36044.86
Organism:
Homo sapiens (Human)
Description:
P41968
Residue:
323
  
Inhibitor
Name:
BDBM82411
Synonyms:
CAS_75921-69-6 | NDP-MSH
Type:
Small organic molecule
Emp. Form.:
C78H111N21O19
Mol. Mass.:
1646.8452
SMILES:
CCCC[C@H](NC(=O)[C@H](CO)NC(=O)[C@H](Cc1ccc(O)cc1)NC(=O)[C@H](CO)NC(C)=O)C(=O)N[C@@H](CCC(O)=O)C(=O)N[C@@H](Cc1cnc[nH]1)C(=O)N[C@H](Cc1ccccc1)C(=O)N[C@@H](CCCN=C(N)N)C(=O)N[C@@H](Cc1c[nH]c2ccccc12)C(=O)NCC(=O)N[C@@H](CCCCN)C(=O)N1CCC[C@H]1C(=O)N[C@@H](C(C)C)C(N)=O
: