Target
Melanocortin receptor 4
Ligand
BDBM50131874
Substrate
Meas. Tech.
ChEMBL_106359 (CHEMBL714439)
Ki
3.1±n/a nM
Citation
 Balse-Srinivasan, PGrieco, PCai, MTrivedi, DHruby, VJ Structure-activity relationships of novel cyclic alpha-MSH/beta-MSH hybrid analogues that lead to potent and selective ligands for the human MC3R and human MC5R. J Med Chem 46:3728-33 (2003)  
Target
Name:
Melanocortin receptor 4
Synonyms:
MC4-R MC4R_HUMAN Melanocortin receptor 4 (MC-4) Melanocortin receptor 4 (MC4R)
Type:
Enzyme
Mol. Mass.:
36949.50
Organism:
Homo sapiens (Human)
Description:
P32245
Residue:
332
  
Inhibitor
Name:
BDBM50131874
Synonyms:
Ac-c[Cys-Glu-His-D-Nal(2')-Arg-Trp-Gly-Cys]-Pro-Pro-Lys-Asp-NH2 | CHEMBL415333
Type:
Small organic molecule
Emp. Form.:
C74H99N19O17S2
Mol. Mass.:
1590.825
SMILES:
CC(=O)[C@@H]1CSSC[C@H](NC(=O)CNC(=O)[C@@H](Cc2c[nH]c3ccccc23)NC(=O)[C@H](CCCNC(N)=N)NC(=O)[C@H](Cc2ccc3ccccc3c2)NC(=O)[C@H](Cc2cnc[nH]2)NC(=O)[C@@H](CCC(O)=O)NC1=O)C(=O)N1CCC[C@H]1C(=O)CN1CCC[C@H]1C(=O)CN[C@@H](CCCCN)C(=O)CN[C@@H](CC(O)=O)C(N)=O
: