Target
Interstitial collagenase
Ligand
BDBM30344
Substrate
Meas. Tech.
ChEMBL_106276 (CHEMBL878345)
Ki
7000±n/a nM
Citation
 Le Diguarher, TChollet, AMBertrand, MHennig, PRaimbaud, ESabatini, MGuilbaud, NPierré, ATucker, GCCasara, P Stereospecific synthesis of 5-substituted 2-bisarylthiocyclopentane carboxylic acids as specific matrix metalloproteinase inhibitors. J Med Chem 46:3840-52 (2003)  
Target
Name:
Interstitial collagenase
Synonyms:
CLG MMP1 Matrix metalloproteinase-1 | Matrix metalloproteinase-1 (MMP-1)
Type:
Enzyme
Mol. Mass.:
54010.26
Organism:
Homo sapiens (Human)
Description:
P03956
Residue:
469
  
Inhibitor
Name:
BDBM30344
Synonyms:
Cipemastat | Trocade
Type:
Small organic molecule
Emp. Form.:
C22H36N4O5
Mol. Mass.:
436.545
SMILES:
CN1C(=O)N(C[C@@H]([C@@H](CC2CCCC2)C(=O)N2CCCCC2)C(=O)NO)C(=O)C1(C)C
: