Target
Hydroxycarboxylic acid receptor 2
Ligand
BDBM50216550
Substrate
Meas. Tech.
ChEMBL_144336 (CHEMBL751847)
Ki
504±n/a nM
Citation
 van Herk, TBrussee, Jvan den Nieuwendijk, AMvan der Klein, PAIJzerman, APStannek, CBurmeister, ALorenzen, A Pyrazole derivatives as partial agonists for the nicotinic acid receptor. J Med Chem 46:3945-51 (2003)  
Target
Name:
Hydroxycarboxylic acid receptor 2
Synonyms:
Gpr109 Gpr109b HM74 nicotinic acid GPCR Niacr1 | Pumag
Type:
PROTEIN
Mol. Mass.:
41476.06
Organism:
Rattus norvegicus
Description:
ChEMBL_820675
Residue:
360
  
Inhibitor
Name:
BDBM50216550
Synonyms:
3-(3-chlorobenzyl)-1H-pyrazole-5-carboxylic acid 5-meta-chlorobenzyl-3-carboxyl-pyrazole | CHEMBL394441
Type:
Small organic molecule
Emp. Form.:
C11H9ClN2O2
Mol. Mass.:
236.654
SMILES:
OC(=O)c1cc(Cc2cccc(Cl)c2)[nH]n1
: