Target
Protein kinase C beta type
Ligand
BDBM50133064
Substrate
Meas. Tech.
ChEMBL_160613 (CHEMBL768097)
IC50
1163±n/a nM
Citation
 Kuo, GHProuty, CDeAngelis, AShen, LO'Neill, DJShah, CConnolly, PJMurray, WVConway, BRCheung, PWestover, LXu, JZLook, RADemarest, KTEmanuel, SMiddleton, SAJolliffe, LBeavers, MPChen, X Synthesis and discovery of macrocyclic polyoxygenated bis-7-azaindolylmaleimides as a novel series of potent and highly selective glycogen synthase kinase-3beta inhibitors. J Med Chem 46:4021-31 (2003)  
Target
Name:
Protein kinase C beta type
Synonyms:
KPCB_HUMAN PKC beta PKCB PRKCB1 Protein kinase C beta type | Protein kinase C beta type II (PRKCB2)
Type:
Enzyme
Mol. Mass.:
76873.67
Organism:
Homo sapiens (Human)
Description:
The recombinant human PKC enzymes were produced using a baculovirus expression system in SF9 cells
Residue:
671
  
Inhibitor
Name:
BDBM50133064
Synonyms:
17,20,23-trioxa-4,12,14,26,28-pentaazahexacyclo[24.6.1.17,14.02,6.08,13.027,32]tetratriaconta-1(33),2(6),7(34),8,10,12,27,29,31-nonaene-3,5-dione | CHEMBL340776
Type:
Small organic molecule
Emp. Form.:
C26H25N5O5
Mol. Mass.:
487.5072
SMILES:
O=C1NC(=O)C2=C1c1cn(CCOCCOCCOCCn3cc2c2cccnc32)c2ncccc12
: