Target
5-hydroxytryptamine receptor 2A
Ligand
BDBM50133229
Substrate
Meas. Tech.
ChEMBL_2259 (CHEMBL617485)
Ki
3.6±n/a nM
Citation
 May, JAChen, HHRusinko, ALynch, VMSharif, NAMcLaughlin, MA A novel and selective 5-HT2 receptor agonist with ocular hypotensive activity: (S)-(+)-1-(2-aminopropyl)-8,9-dihydropyrano[3,2-e]indole. J Med Chem 46:4188-95 (2003)  
Target
Name:
5-hydroxytryptamine receptor 2A
Synonyms:
5-HT-2 5-HT2A 5-hydroxytryptamine receptor 2A (5HT-2A) 5HT2A_HUMAN HTR2A | Serotonin receptor 2A
Type:
undefined
Mol. Mass.:
52607.65
Organism:
Homo sapiens (Human)
Description:
P28223
Residue:
471
  
Inhibitor
Name:
BDBM50133229
Synonyms:
1-Methyl-2-(3,7,8,9-tetrahydro-pyrano[3,2-e]indol-1-yl)-ethylamine | CHEMBL133868
Type:
Small organic molecule
Emp. Form.:
C14H18N2O
Mol. Mass.:
230.3055
SMILES:
CC(N)Cc1c[nH]c2ccc3OCCCc3c12
: