Target
5-hydroxytryptamine receptor 2A
Ligand
BDBM50133232
Substrate
Meas. Tech.
ChEMBL_2672 (CHEMBL617920)
Ki
0.2±n/a nM
Citation
 May, JAChen, HHRusinko, ALynch, VMSharif, NAMcLaughlin, MA A novel and selective 5-HT2 receptor agonist with ocular hypotensive activity: (S)-(+)-1-(2-aminopropyl)-8,9-dihydropyrano[3,2-e]indole. J Med Chem 46:4188-95 (2003)  
Target
Name:
5-hydroxytryptamine receptor 2A
Synonyms:
5-HT-2A 5-HT2A 5-hydroxytryptamine receptor 2A (5HT2A) Htr2 Serotonin Receptor 2A
Type:
G Protein-Coupled Receptor (GPCR)
Mol. Mass.:
52852.05
Organism:
Rattus norvegicus (rat)
Description:
Rat cortex membranes 5-HT2A receptors.
Residue:
471
  
Inhibitor
Name:
BDBM50133232
Synonyms:
(S)-1-Methyl-2-(3,7,8,9-tetrahydro-pyrano[3,2-e]indol-1-yl)-ethylamine | CHEMBL133455
Type:
Small organic molecule
Emp. Form.:
C14H18N2O
Mol. Mass.:
230.3055
SMILES:
C[C@H](N)Cc1c[nH]c2ccc3OCCCc3c12
: