Target
5-hydroxytryptamine receptor 1A
Ligand
BDBM50122814
Substrate
Meas. Tech.
ChEMBL_894 (CHEMBL615805)
Ki
12±n/a nM
Citation
 Balle, TPerregaard, JRamirez, MTLarsen, AKSøby, KKLiljefors, TAndersen, K Synthesis and structure-affinity relationship investigations of 5-heteroaryl-substituted analogues of the antipsychotic sertindole. A new class of highly selective alpha(1) adrenoceptor antagonists. J Med Chem 46:265-83 (2003)  
Target
Name:
5-hydroxytryptamine receptor 1A
Synonyms:
5-HT-1A 5-hydroxytryptamine receptor 1A (5-HT-1A) ADRB2RL1 Dopamine D2 receptor and serotonin 1a receptor HTR1A | Serotonin receptor 1A
Type:
Mol. Mass.:
46122.49
Organism:
Homo sapiens (Human)
Description:
Residue:
422
  
Inhibitor
Name:
BDBM50122814
Synonyms:
1-(2-{4-[1-(4-Fluoro-phenyl)-5-pyrimidin-2-yl-1H-indol-3-yl]-piperidin-1-yl}-ethyl)-imidazolidin-2-one | CHEMBL421573
Type:
Small organic molecule
Emp. Form.:
C28H29FN6O
Mol. Mass.:
484.5679
SMILES:
Fc1ccc(cc1)-n1cc(C2CCN(CCN3CCNC3=O)CC2)c2cc(ccc12)-c1ncccn1
: