Target
Mu-type opioid receptor
Ligand
BDBM50133265
Substrate
Meas. Tech.
ChEMBL_149336 (CHEMBL756439)
Ki
136±n/a nM
Citation
 Hruby, VJ Peptide science: exploring the use of chemical principles and interdisciplinary collaboration for understanding life processes. J Med Chem 46:4215-31 (2003)  
Target
Name:
Mu-type opioid receptor
Synonyms:
M-OR-1 MOR-1 MUOR1 Mu opiate receptor OPRM1 hMOP | mu-type opioid receptor isoform MOR-1
Type:
G Protein-Coupled Receptor (GPCR)
Mol. Mass.:
44789.51
Organism:
Homo sapiens (Human)
Description:
P35372
Residue:
400
  
Inhibitor
Name:
BDBM50133265
Synonyms:
CHEMBL411201 | H-Tyr-D-Phe-Glu-Trp-N-MeNle-Asp-Phe-NH2
Type:
Small organic molecule
Emp. Form.:
C54H65N9O12
Mol. Mass.:
1032.147
SMILES:
CCCC[C@H](N(C)C(=O)[C@H](Cc1c[nH]c2ccccc12)NC(=O)[C@H](CCC(O)=O)NC(=O)[C@H](Cc1ccccc1)NC(=O)[C@@H](N)Cc1ccc(O)cc1)C(=O)N[C@@H](CC(O)=O)C(=O)N[C@@H](Cc1ccccc1)C(N)=O
: