Target
C-C chemokine receptor type 5
Ligand
BDBM50134057
Substrate
Meas. Tech.
ChEMBL_39639 (CHEMBL649945)
Ki
26±n/a nM
Citation
 Debnath, AK Generation of predictive pharmacophore models for CCR5 antagonists: study with piperidine- and piperazine-based compounds as a new class of HIV-1 entry inhibitors. J Med Chem 46:4501-15 (2003)  
Target
Name:
C-C chemokine receptor type 5
Synonyms:
C-C CKR-5 CC-CKR-5 CCR5 CCR5_HUMAN CHEMR13 HIV-1 fusion coreceptor
Type:
Enzyme
Mol. Mass.:
40540.21
Organism:
Homo sapiens (Human)
Description:
P51681
Residue:
352
  
Inhibitor
Name:
BDBM50134057
Synonyms:
(4-{(4-Bromo-phenyl)-[(E)-ethoxyimino]-methyl}-4'-methyl-[1,4']bipiperidinyl-1'-yl)-(2-methyl-pyridin-3-yl)-methanone | CHEMBL138028
Type:
Small organic molecule
Emp. Form.:
C27H35BrN4O2
Mol. Mass.:
527.496
SMILES:
CCO\N=C(/C1CCN(CC1)C1(C)CCN(CC1)C(=O)c1cccnc1C)c1ccc(Br)cc1
: