Target
Dipeptidyl peptidase 2
Ligand
BDBM50118934
Substrate
Meas. Tech.
ChEMBL_53369 (CHEMBL666615)
Ki
277±n/a nM
Citation
 Senten, KVan der Veken, PDe Meester, ILambeir, AMScharpé, SHaemers, AAugustyns, K Design, synthesis, and SAR of potent and selective dipeptide-derived inhibitors for dipeptidyl peptidases. J Med Chem 46:5005-14 (2003)  
Target
Name:
Dipeptidyl peptidase 2
Synonyms:
DAP II DPP2_HUMAN Dipeptidyl aminopeptidase II Dipeptidyl peptidase 2 (DPP2) Dipeptidyl peptidase II (DPP II) Dipeptidyl peptidase II and dipeptidyl peptidase IV (DPP2 and DPP4) carboxytripeptidase dipeptidyl(amino)peptidase II | dipeptidylarylamidase
Type:
Protein
Mol. Mass.:
54339.29
Organism:
Homo sapiens (Human)
Description:
Q9UHL4
Residue:
492
  
Inhibitor
Name:
BDBM50118934
Synonyms:
(S)-2-Amino-1-thiazolidin-3-yl-propane-1-thione | CHEMBL318401
Type:
Small organic molecule
Emp. Form.:
C6H12N2S2
Mol. Mass.:
176.303
SMILES:
C[C@H](N)C(=S)N1CCSC1
: