Target
Androgen receptor
Ligand
BDBM50135908
Substrate
Meas. Tech.
ChEMBL_36123 (CHEMBL647749)
IC50
6±n/a nM
Citation
 Cogan, PSKoch, TH Rational design and synthesis of androgen receptor-targeted nonsteroidal anti-androgen ligands for the tumor-specific delivery of a doxorubicin-formaldehyde conjugate. J Med Chem 46:5258-70 (2003)  
Target
Name:
Androgen receptor
Synonyms:
ANDR_HUMAN Androgen Receptor Androgen receptor/Baculoviral IAP repeat-containing protein 2 Dihydrotestosterone receptor Nuclear receptor subfamily 3 group C member 4
Type:
Receptor
Mol. Mass.:
99185.27
Organism:
Homo sapiens (Human)
Description:
CHO cells were stably transfected with human AR gene.
Residue:
920
  
Inhibitor
Name:
BDBM50135908
Synonyms:
4-(4,4-Dimethyl-2,5-dioxo-imidazolidin-1-yl)-2-trifluoromethyl-benzonitrile Cyanonilutamide
Type:
Small organic molecule
Emp. Form.:
C13H10F3N3O2
Mol. Mass.:
297.2326
SMILES:
CC1(C)NC(=O)N(C1=O)c1ccc(C#N)c(c1)C(F)(F)F
: