Target
Androgen receptor
Ligand
BDBM50135915
Substrate
Meas. Tech.
ChEMBL_36123 (CHEMBL647749)
IC50
346±n/a nM
Citation
 Cogan, PSKoch, TH Rational design and synthesis of androgen receptor-targeted nonsteroidal anti-androgen ligands for the tumor-specific delivery of a doxorubicin-formaldehyde conjugate. J Med Chem 46:5258-70 (2003)  
Target
Name:
Androgen receptor
Synonyms:
ANDR_HUMAN Androgen Receptor Androgen receptor/Baculoviral IAP repeat-containing protein 2 Dihydrotestosterone receptor Nuclear receptor subfamily 3 group C member 4
Type:
Receptor
Mol. Mass.:
99185.27
Organism:
Homo sapiens (Human)
Description:
CHO cells were stably transfected with human AR gene.
Residue:
920
  
Inhibitor
Name:
BDBM50135915
Synonyms:
5-{2-[4-(2-{2-[3-(4-Cyano-3-trifluoromethyl-phenyl)-5,5-dimethyl-2,4-dioxo-imidazolidin-1-yl]-ethoxy}-ethyl)-piperazin-1-yl]-ethoxymethyl}-2-hydroxy-benzamide | CHEMBL347556
Type:
Small organic molecule
Emp. Form.:
C31H37F3N6O6
Mol. Mass.:
646.6573
SMILES:
CC1(C)N(CCOCCN2CCN(CCOCc3ccc(O)c(c3)C(N)=O)CC2)C(=O)N(C1=O)c1ccc(C#N)c(c1)C(F)(F)F
: