Target
Androgen receptor
Ligand
BDBM50135912
Substrate
Meas. Tech.
ChEMBL_36123 (CHEMBL647749)
IC50
9±n/a nM
Citation
 Cogan, PSKoch, TH Rational design and synthesis of androgen receptor-targeted nonsteroidal anti-androgen ligands for the tumor-specific delivery of a doxorubicin-formaldehyde conjugate. J Med Chem 46:5258-70 (2003)  
Target
Name:
Androgen receptor
Synonyms:
ANDR_HUMAN Androgen Receptor Androgen receptor/Baculoviral IAP repeat-containing protein 2 Dihydrotestosterone receptor Nuclear receptor subfamily 3 group C member 4
Type:
Receptor
Mol. Mass.:
99185.27
Organism:
Homo sapiens (Human)
Description:
CHO cells were stably transfected with human AR gene.
Residue:
920
  
Inhibitor
Name:
BDBM50135912
Synonyms:
5,5-Dimethyl-3-(alpha,alpha,alpha-trifluoro-4-nitro-m-tolyl)hydantoin CHEMBL1274 | NILUTAMIDE
Type:
Small organic molecule
Emp. Form.:
C12H10F3N3O4
Mol. Mass.:
317.2207
SMILES:
CC1(C)NC(=O)N(C1=O)c1ccc(c(c1)C(F)(F)F)[N+]([O-])=O
: