Target
Purine nucleoside phosphorylase
Ligand
BDBM50293086
Substrate
Meas. Tech.
ChEMBL_162007 (CHEMBL764178)
Ki
0.042000±n/a nM
Citation
 Evans, GBFurneaux, RHLewandowicz, ASchramm, VLTyler, PC Synthesis of second-generation transition state analogues of human purine nucleoside phosphorylase. J Med Chem 46:5271-6 (2003)  
Target
Name:
Purine nucleoside phosphorylase
Synonyms:
Inosine phosphorylase NP PNPH_HUMAN | Purine nucleoside phosphorylase (PNPase)
Type:
Enzyme
Mol. Mass.:
32119.53
Organism:
Homo sapiens (Human)
Description:
Residue:
289
  
Inhibitor
Name:
BDBM50293086
Synonyms:
(1S)-1,4-dideoxy-1,4-imino-1-(9-deazaguanin-9-yl)-D-ribitol 2-amino-7-[(2S,3S,4R,5R)-3,4-dihydroxy-5-(hydroxymethyl)pyrrolidin-2-yl]-1,5-dihydro-4H-pyrrolo[3,2-d]pyrimidin-4-one immucillin G
Type:
Small organic molecule
Emp. Form.:
C11H15N5O4
Mol. Mass.:
281.2679
SMILES:
Nc1nc2c(c[nH]c2c(=O)[nH]1)[C@@H]1N[C@H](CO)[C@@H](O)[C@H]1O
: