Target
Kappa-type opioid receptor
Ligand
BDBM50136114
Substrate
Meas. Tech.
ChEMBL_145259 (CHEMBL751037)
Ki
0.660000±n/a nM
Citation
 Black, SLChauvignac, CGrundt, PMiller, CNWood, STraynor, JRLewis, JWHusbands, SM Guanidino N-substituted and N,N-disubstituted derivatives of the kappa-opioid antagonist GNTI. J Med Chem 46:5505-11 (2003)  
Target
Name:
Kappa-type opioid receptor
Synonyms:
K-OR-1 Kappa-opioid receptor (KOR) Kappa-type opioid receptor (KOR) OPIATE Kappa OPRK1 kappa opioid receptor (KOR)
Type:
G Protein-Coupled Receptor (GPCR)
Mol. Mass.:
42648.76
Organism:
Homo sapiens (Human)
Description:
P41145
Residue:
380
  
Inhibitor
Name:
BDBM50136114
Synonyms:
7-[4-chlorobenzylamino(imino)methylamino]-22-cyclopropylmethyl-14-oxa-11,22-diazaheptacyclo[13.9.1.01,13.02,21.04,12.05,10.019,25]pentacosa-4(12),5(10),6,8,15,17,19(25)-heptaene-2,16-diol
Type:
Small organic molecule
Emp. Form.:
C34H34ClN5O3
Mol. Mass.:
596.118
SMILES:
NC(NCc1ccc(Cl)cc1)=Nc1ccc2[nH]c3[C@@H]4Oc5c6c(CC7N(CC8CC8)CC[C@@]46[C@@]7(O)Cc3c2c1)ccc5O
: