Target
Sodium-dependent serotonin transporter
Ligand
BDBM50136138
Substrate
Meas. Tech.
ChEMBL_201814 (CHEMBL805322)
Ki
7.10±n/a nM
Citation
 Orjales, AMosquera, RToledo, APumar, MCGarcía, NCortizo, LLabeaga, LInnerárity, A Syntheses and binding studies of new [(aryl)(aryloxy)methyl]piperidine derivatives and related compounds as potential antidepressant drugs with high affinity for serotonin (5-HT) and norepinephrine (NE) transporters. J Med Chem 46:5512-32 (2003)  
Target
Name:
Sodium-dependent serotonin transporter
Synonyms:
5-HT Transporter 5HT transporter Anandamid membrane transporter, AMT Monoamine transporters; Norepinephrine & serotonin Slc6a4 Sodium-dependent serotonin transporter (SERT) | imipramine receptor
Type:
Multi-pass membrane protein
Mol. Mass.:
70168.43
Organism:
Rattus norvegicus (rat)
Description:
P31652
Residue:
630
  
Inhibitor
Name:
BDBM50136138
Synonyms:
4-[(3,5-Difluoro-phenoxy)-phenyl-methyl]-piperidine | CHEMBL348704
Type:
Small organic molecule
Emp. Form.:
C18H19F2NO
Mol. Mass.:
303.3464
SMILES:
Fc1cc(F)cc(OC(C2CCNCC2)c2ccccc2)c1
: