Target
Nitric oxide synthase, brain
Ligand
BDBM50059643
Substrate
Meas. Tech.
ChEMBL_143519 (CHEMBL755132)
Ki
2000±n/a nM
Citation
 Ji, HLi, HFlinspach, MPoulos, TLSilverman, RB Computer modeling of selective regions in the active site of nitric oxide synthases: implication for the design of isoform-selective inhibitors. J Med Chem 46:5700-11 (2003)  
Target
Name:
Nitric oxide synthase, brain
Synonyms:
Nitric Oxide Synthase, brain
Type:
Mol. Mass.:
Description:
ASSAY_ID of EBI is 143519
Components:
This complex has 2 components.
Component 1
Name:
Nitric oxide synthase, brain
Synonyms:
Constitutive NOS NC-NOS NOS type I nNOS NOS1_HUMAN Neuronal nitric oxide synthase Nitric oxide synthase, neuronal (nNOS) bNOS | nNOS
Type:
Homodimer
Mol. Mass.:
160985.98
Organism:
Homo sapiens (Human)
Description:
P29475
Residue:
1434
  
Component 2
Name:
Nitric oxide synthase, brain
Synonyms:
Bnos NC-NOS NOS type I nNOS Neuronal nitric oxide synthase Nitric Oxide Synthase, brain Nitric oxide synthase, brain (nNOS) Nitric-oxide synthase, brain (nNOS) Nos1 | Peptidyl-cysteine S-nitrosylase NOS1
Type:
Enzyme
Mol. Mass.:
160570.98
Organism:
Rattus norvegicus (rat)
Description:
Recombinant nNOS overexpressed in E. coli was used in enzyme assays.
Residue:
1429
  
Inhibitor
Name:
BDBM50059643
Synonyms:
CHEMBL297096 D-Phenylalanine,methoxy-D-Nitroarginine,with 2M of TFA | methyl 2-[1-amino-2-phenyl-(1R)-ethylcarboxamido]-5-imino(nitroamino)methylamino-(2R)-pentanoate
Type:
Small organic molecule
Emp. Form.:
C16H24N6O5
Mol. Mass.:
380.399
SMILES:
COC(=O)[C@@H](CCCNC(=N)N[N+]([O-])=O)NC(=O)[C@H](N)Cc1ccccc1
: