Target
Solute carrier family 15 member 1
Ligand
BDBM50136959
Substrate
Meas. Tech.
ChEMBL_89213 (CHEMBL699705)
Ki
90000±n/a nM
Citation
 Gebauer, SKnütter, IHartrodt, BBrandsch, MNeubert, KThondorf, I Three-dimensional quantitative structure-activity relationship analyses of peptide substrates of the mammalian H+/peptide cotransporter PEPT1. J Med Chem 46:5725-34 (2003)  
Target
Name:
Solute carrier family 15 member 1
Synonyms:
Intestinal H(+)/peptide cotransporter Oligopeptide transporter, small intestine isoform Peptide transporter 1 SLC15A1
Type:
PROTEIN
Mol. Mass.:
78818.07
Organism:
Homo sapiens (Human)
Description:
ChEMBL_1488839
Residue:
708
  
Inhibitor
Name:
BDBM50136959
Synonyms:
2-{[2-ammonio-3-(4-hydroxyphenyl)propanoyl]amino}propanoate | CHEMBL152282
Type:
Small organic molecule
Emp. Form.:
C12H16N2O4
Mol. Mass.:
252.2664
SMILES:
CC(NC(=O)C([NH3+])Cc1ccc(O)cc1)C([O-])=O
: