Target
Aldo-keto reductase family 1 member B1
Ligand
BDBM16314
Substrate
Meas. Tech.
ChEMBL_32260 (CHEMBL645594)
IC50
35±n/a nM
Citation
 Nicolaou, IDemopoulos, VJ Substituted pyrrol-1-ylacetic acids that combine aldose reductase enzyme inhibitory activity and ability to prevent the nonenzymatic irreversible modification of proteins from monosaccharides. J Med Chem 46:417-26 (2003)  
Target
Name:
Aldo-keto reductase family 1 member B1
Synonyms:
AKR1B1 ALDR_HUMAN AR Aldose Reductase (ALR2) Aldose reductase (AR)
Type:
Protein
Mol. Mass.:
35855.50
Organism:
Homo sapiens (Human)
Description:
P15121. 4LAU; 2IKI; 4LB4; 2FZD; 2FZ8; 1US0
Residue:
316
  
Inhibitor
Name:
BDBM16314
Synonyms:
2-{[6-methoxy-5-(trifluoromethyl)naphthalen-1-yl]-N-methylmethanethioamido}acetic acid CHEMBL436 Tolrestat
Type:
Small organic molecule
Emp. Form.:
C16H14F3NO3S
Mol. Mass.:
357.347
SMILES:
COc1ccc2c(cccc2c1C(F)(F)F)C(=S)N(C)CC(O)=O
: