Target
Prothrombin
Ligand
BDBM50125842
Substrate
Meas. Tech.
ChEMBL_207987 (CHEMBL816070)
IC50
0.0017±n/a nM
Citation
 Thorstensson, FKvarnström, IMusil, DNilsson, ISamuelsson, B Synthesis of novel thrombin inhibitors. Use of ring-closing metathesis reactions for synthesis of P2 cyclopentene- and cyclohexenedicarboxylic acid derivatives. J Med Chem 46:1165-79 (2003)  
Target
Name:
Prothrombin
Synonyms:
Activation peptide fragment 1 Coagulation factor II Prothrombin precursor Thrombin heavy chain | Thrombin light chain
Type:
Protein
Mol. Mass.:
70029.57
Organism:
Homo sapiens (Human)
Description:
P00734
Residue:
622
  
Inhibitor
Name:
BDBM50125842
Synonyms:
5-amino(imino)methylamino-2-[1-[2-amino-3-phenyl-(2S)-propanoyl]-(5S)-dihydro-1H-5-pyrrolylcarboxamido]-(2S)-pentanoic acid D-Phe-Pro-Arg
Type:
Small organic molecule
Emp. Form.:
C20H30N6O4
Mol. Mass.:
418.49
SMILES:
N[C@@H](Cc1ccccc1)C(=O)N1CCC[C@H]1C(=O)N[C@@H](CCCNC(N)=N)C(O)=O
: