Target
Adenosine receptor A2a
Ligand
BDBM50048466
Substrate
Meas. Tech.
ChEMBL_30016 (CHEMBL641307)
Ki
2.3±n/a nM
Citation
 Baraldi, PGFruttarolo, FTabrizi, MAPreti, DRomagnoli, REl-Kashef, HMoorman, AVarani, KGessi, SMerighi, SBorea, PA Design, synthesis, and biological evaluation of C9- and C2-substituted pyrazolo[4,3-e]-1,2,4-triazolo[1,5-c]pyrimidines as new A2A and A3 adenosine receptors antagonists. J Med Chem 46:1229-41 (2003)  
Target
Name:
Adenosine receptor A2a
Synonyms:
AA2AR_RAT Adenosine A2 receptor Adenosine Receptors A2a (A2a) Adenosine receptors A2a Rat striatal adenosine A2a receptor
Type:
G Protein-Coupled Receptor (GPCR)
Mol. Mass.:
45015.65
Organism:
Rattus norvegicus (rat)
Description:
Rat A2A receptors expressed in CHO cells.
Residue:
410
  
Inhibitor
Name:
BDBM50048466
Synonyms:
2-(furan-2-yl)-7-phenethyl-7H-pyrazolo[4,3-e][1,2,4]triazolo[1,5-c]pyrimidin-5-amine 2-Furan-2-yl-7-phenethyl-7H-pyrazolo[4,3-e][1,2,4]triazolo[1,5-c]pyrimidin-5-ylamine(SCH 58261) SCH-58261 US11440916, HZ10126
Type:
Small organic molecule
Emp. Form.:
C18H15N7O
Mol. Mass.:
345.358
SMILES:
Nc1nc2n(CCc3ccccc3)ncc2c2nc(nn12)-c1ccco1
: