Target
Adenosine receptor A2b
Ligand
BDBM50125929
Substrate
Meas. Tech.
ChEMBL_30421 (CHEMBL645975)
Ki
69±n/a nM
Citation
 Baraldi, PGFruttarolo, FTabrizi, MAPreti, DRomagnoli, REl-Kashef, HMoorman, AVarani, KGessi, SMerighi, SBorea, PA Design, synthesis, and biological evaluation of C9- and C2-substituted pyrazolo[4,3-e]-1,2,4-triazolo[1,5-c]pyrimidines as new A2A and A3 adenosine receptors antagonists. J Med Chem 46:1229-41 (2003)  
Target
Name:
Adenosine receptor A2b
Synonyms:
AA2BR_HUMAN ADORA2B Adenosine receptors A2b | Adenosine receptors; A2a & A2b
Type:
G Protein-Coupled Receptor (GPCR)
Mol. Mass.:
36341.22
Organism:
Homo sapiens (Human)
Description:
Residue:
332
  
Inhibitor
Name:
BDBM50125929
Synonyms:
2-(furan-2-yl)-8-methyl-9-(propylthio)-8H-pyrazolo[4,3-e][1,2,4]triazolo[1,5-c]pyrimidin-5-amine CHEMBL280888
Type:
Small organic molecule
Emp. Form.:
C14H15N7OS
Mol. Mass.:
329.38
SMILES:
CCCSc1n(C)nc2nc(N)n3nc(nc3c12)-c1ccco1
: