Target
Adenosine receptor A2a
Ligand
BDBM50125926
Substrate
Meas. Tech.
ChEMBL_31493 (CHEMBL649802)
Ki
22±n/a nM
Citation
 Baraldi, PGFruttarolo, FTabrizi, MAPreti, DRomagnoli, REl-Kashef, HMoorman, AVarani, KGessi, SMerighi, SBorea, PA Design, synthesis, and biological evaluation of C9- and C2-substituted pyrazolo[4,3-e]-1,2,4-triazolo[1,5-c]pyrimidines as new A2A and A3 adenosine receptors antagonists. J Med Chem 46:1229-41 (2003)  
Target
Name:
Adenosine receptor A2a
Synonyms:
A2A adenosine receptor (hA2A) ADENOSINE A2 ADORA2 Adenosine A2A receptor (A2AAR)
Type:
G Protein-Coupled Receptor (GPCR)
Mol. Mass.:
44716.46
Organism:
Homo sapiens (Human)
Description:
P29274
Residue:
412
  
Inhibitor
Name:
BDBM50125926
Synonyms:
2-Furan-2-yl-9-methylsulfanyl-8-(3-phenyl-propyl)-8H-pyrazolo[4,3-e][1,2,4]triazolo[1,5-c]pyrimidin-5-ylamine | CHEMBL20445
Type:
Small organic molecule
Emp. Form.:
C20H19N7OS
Mol. Mass.:
405.476
SMILES:
CSc1n(CCCc2ccccc2)nc2nc(N)n3nc(nc3c12)-c1ccco1
: