Target
Adenosine receptor A2a
Ligand
BDBM50125931
Substrate
Meas. Tech.
ChEMBL_31206 (CHEMBL640303)
IC50
21.5±n/a nM
Citation
 Baraldi, PGFruttarolo, FTabrizi, MAPreti, DRomagnoli, REl-Kashef, HMoorman, AVarani, KGessi, SMerighi, SBorea, PA Design, synthesis, and biological evaluation of C9- and C2-substituted pyrazolo[4,3-e]-1,2,4-triazolo[1,5-c]pyrimidines as new A2A and A3 adenosine receptors antagonists. J Med Chem 46:1229-41 (2003)  
Target
Name:
Adenosine receptor A2a
Synonyms:
A2A adenosine receptor (hA2A) ADENOSINE A2 ADORA2 Adenosine A2A receptor (A2AAR)
Type:
G Protein-Coupled Receptor (GPCR)
Mol. Mass.:
44716.46
Organism:
Homo sapiens (Human)
Description:
P29274
Residue:
412
  
Inhibitor
Name:
BDBM50125931
Synonyms:
2-Benzo[1,3]dioxol-5-yl-N-(2-furan-2-yl-8-methyl-9-methylsulfanyl-8H-pyrazolo[4,3-e][1,2,4]triazolo[1,5-c]pyrimidin-5-yl)-acetamide | CHEMBL21572
Type:
Small organic molecule
Emp. Form.:
C21H17N7O4S
Mol. Mass.:
463.469
SMILES:
CSc1n(C)nc2nc(NC(=O)Cc3ccc4OCOc4c3)n3nc(nc3c12)-c1ccco1
: