Target
Nitric oxide synthase, inducible
Ligand
BDBM50127047
Substrate
Meas. Tech.
ChEMBL_89366 (CHEMBL699600)
Ki
392000±n/a nM
Citation
 Hah, JMMartásek, PRoman, LJSilverman, RB Aromatic reduced amide bond peptidomimetics as selective inhibitors of neuronal nitric oxide synthase. J Med Chem 46:1661-9 (2003)  
Target
Name:
Nitric oxide synthase, inducible
Synonyms:
Inducible NO synthase Inducible nitric oxide synthase (iNOS) MAC-NOS NOS type II Nitric Oxide Synthase, inducible Nos2
Type:
Enzyme
Mol. Mass.:
130595.79
Organism:
Mus musculus (mouse)
Description:
Recombinant enzyme overexpressed in E. coli.
Residue:
1144
  
Inhibitor
Name:
BDBM50127047
Synonyms:
CHEMBL46974 | N-{(4S)-4-amino-5-[(pyridin-4-ylmethyl)amino]pentyl}-N'-nitroguanidine
Type:
Small organic molecule
Emp. Form.:
C12H21N7O2
Mol. Mass.:
295.3408
SMILES:
N[C@@H](CCCNC(=N)N[N+]([O-])=O)CNCc1ccncc1
: